Reaction Details
TargetMonoglyceride lipase
LigandBDBM50438782
Substrate/Competitorn/a
Meas. Tech.ChEMBL_1453719 (CHEMBL3364121)
IC50>100000±n/a nM
Citation Hajdu, ZNicolussi, SRau, MLorántfy, LForgo, PHohmann, JCsupor, DGertsch, J Identification of endocannabinoid system-modulating N-alkylamides from Heliopsis helianthoides var. scabra and Lepidium meyenii. J Nat Prod77:1663-9 (2014) 
 
Monoglyceride lipase
Name:Monoglyceride lipase
Type:Hydrolase
Mol. Mass.:33391.67
Organism:Mus musculus (mouse)
Description:Assays were using membranes of recombinant MAG Lipase transiently transfected in COS-7 cells.
Residue:303
BDBM50438782
NameBDBM50438782
Synonyms:CHEMBL2413162
TypeSmall organic molecule
Emp. Form.C26H39NO2
Mol. Mass.397.5934
SMILESCC\C=C/C\C=C/C\C=C/CCCCCCCC(=O)NCc1cccc(OC)c1