Reaction Details
TargetMonoglyceride lipase
LigandBDBM50048063
Substrate/Competitorn/a
Meas. Tech.ChEMBL_1453719 (CHEMBL3364121)
IC50>100000±n/a nM
Citation Hajdu, ZNicolussi, SRau, MLorántfy, LForgo, PHohmann, JCsupor, DGertsch, J Identification of endocannabinoid system-modulating N-alkylamides from Heliopsis helianthoides var. scabra and Lepidium meyenii. J Nat Prod77:1663-9 (2014) 
 
Monoglyceride lipase
Name:Monoglyceride lipase
Type:Hydrolase
Mol. Mass.:33391.67
Organism:Mus musculus (mouse)
Description:Assays were using membranes of recombinant MAG Lipase transiently transfected in COS-7 cells.
Residue:303
BDBM50048063
NameBDBM50048063
Synonyms:CHEMBL3314943
TypeSmall organic molecule
Emp. Form.C21H35NO
Mol. Mass.317.5087
SMILESCCC\C=C\C\C=C\CCC\C=C\C=C\C(=O)NCC(C)CC