Reaction Details
TargetFatty-acid amide hydrolase 1
LigandBDBM50048065
Substrate/Competitorn/a
Meas. Tech.ChEMBL_1453717 (CHEMBL3364119)
IC50 17780±n/a nM
Citation Hajdu, ZNicolussi, SRau, MLorántfy, LForgo, PHohmann, JCsupor, DGertsch, J Identification of endocannabinoid system-modulating N-alkylamides from Heliopsis helianthoides var. scabra and Lepidium meyenii. J Nat Prod77:1663-9 (2014) 
 
Fatty-acid amide hydrolase 1
Name:Fatty-acid amide hydrolase 1
Type:Protein
Mol. Mass.:63071.19
Organism:Homo sapiens (Human)
Description:O00519
Residue:579
BDBM50048065
NameBDBM50048065
Synonyms:CHEMBL3314941
TypeSmall organic molecule
Emp. Form.C22H31NO
Mol. Mass.325.4876
SMILESCCC\C=C/C#C\C=C/C=C/CC\C=C\C=C\C(=O)NCC(C)C