Reaction Details
TargetGalectin-7
LigandBDBM50048093
Substrate/Competitorn/a
Meas. Tech.ChEMBL_1454624 (CHEMBL3361813)
Kd 110000±n/a nM
Citation Rajput, VKLeffler, HNilsson, UJMukhopadhyay, B Synthesis and evaluation of iminocoumaryl and coumaryl derivatized glycosides as galectin antagonists. Bioorg Med Chem Lett24:3516-20 (2014) 
 
Galectin-7
Name:Galectin-7
Type:Galactoside-binding protein
Mol. Mass.:15077.89
Organism:Homo sapiens (Human)
Description:n/a
Residue:136
BDBM50048093
NameBDBM50048093
Synonyms:CHEBI:610092 Lactoside | Methyl Beta-D-Lactoside
TypeSmall organic molecule
Emp. Form.C13H24O11
Mol. Mass.356.3231
SMILESCO[C@@H]1O[C@H](CO)[C@@H](O[C@@H]2O[C@H](CO)[C@H](O)[C@H](O)[C@H]2O)[C@H](O)[C@H]1O