Reaction Details
TargetGalectin-7
LigandBDBM50048096
Substrate/Competitorn/a
Meas. Tech.ChEMBL_1454624 (CHEMBL3361813)
Kd 1100000±n/a nM
Citation Rajput, VKLeffler, HNilsson, UJMukhopadhyay, B Synthesis and evaluation of iminocoumaryl and coumaryl derivatized glycosides as galectin antagonists. Bioorg Med Chem Lett24:3516-20 (2014) 
 
Galectin-7
Name:Galectin-7
Type:Galactoside-binding protein
Mol. Mass.:15077.89
Organism:Homo sapiens (Human)
Description:n/a
Residue:136
BDBM50048096
NameBDBM50048096
Synonyms:CHEMBL3311524
TypeSmall organic molecule
Emp. Form.C23H25NO9S
Mol. Mass.491.511
SMILESCO[C@H]1O[C@H](CO)[C@H](O)[C@H](OCc2cc3ccccc3o\c2=N/S(=O)(=O)c2ccccc2)[C@H]1O