Reaction Details
TargetGalectin-7
LigandBDBM21540
Substrate/Competitorn/a
Meas. Tech.ChEMBL_1454624 (CHEMBL3361813)
Kd>2000000±n/a nM
Citation Rajput, VKLeffler, HNilsson, UJMukhopadhyay, B Synthesis and evaluation of iminocoumaryl and coumaryl derivatized glycosides as galectin antagonists. Bioorg Med Chem Lett24:3516-20 (2014) 
 
Galectin-7
Name:Galectin-7
Type:Galactoside-binding protein
Mol. Mass.:15077.89
Organism:Homo sapiens (Human)
Description:n/a
Residue:136
BDBM21540
NameBDBM21540
Synonyms:Galactose-Derived Compound 18 | N-[(2R,3R,4S,5R,6S)-3,5-dihydroxy-2-(hydroxymethyl)-6-(methylsulfanyl)oxan-4-yl]-4-methylbenzamide
TypeSmall organic molecule
Emp. Form.C15H21NO5S
Mol. Mass.327.396
SMILESCS[C@@H]1O[C@H](CO)[C@H](O)[C@H](NC(=O)c2ccc(C)cc2)[C@H]1O