Reaction Details
TargetGalectin-8
LigandBDBM50048092
Substrate/Competitorn/a
Meas. Tech.ChEMBL_1454625 (CHEMBL3361814)
Kd 140000±n/a nM
Citation Rajput, VKLeffler, HNilsson, UJMukhopadhyay, B Synthesis and evaluation of iminocoumaryl and coumaryl derivatized glycosides as galectin antagonists. Bioorg Med Chem Lett24:3516-20 (2014) 
 
Galectin-8
Name:Galectin-8
Type:PROTEIN
Mol. Mass.:35814.23
Organism:Homo sapiens (Human)
Description:ChEMBL_1454625
Residue:317
BDBM50048092
NameBDBM50048092
Synonyms:CHEMBL3311521
TypeSmall organic molecule
Emp. Form.C29H35NO14S
Mol. Mass.653.652
SMILES[H][C@@]1(O[C@@H]2[C@@H](CO)O[C@@H](OCc3cc4ccccc4o\c3=N/S(=O)(=O)c3ccc(C)cc3)[C@H](O)[C@H]2O)O[C@H](CO)[C@H](O)[C@H](O)[C@H]1O