Reaction Details
TargetGalectin-8
LigandBDBM50048095
Substrate/Competitorn/a
Meas. Tech.ChEMBL_1454625 (CHEMBL3361814)
Kd 170000±n/a nM
Citation Rajput, VKLeffler, HNilsson, UJMukhopadhyay, B Synthesis and evaluation of iminocoumaryl and coumaryl derivatized glycosides as galectin antagonists. Bioorg Med Chem Lett24:3516-20 (2014) 
 
Galectin-8
Name:Galectin-8
Type:PROTEIN
Mol. Mass.:35814.23
Organism:Homo sapiens (Human)
Description:ChEMBL_1454625
Residue:317
BDBM50048095
NameBDBM50048095
Synonyms:CHEMBL3311523
TypeSmall organic molecule
Emp. Form.C26H29NO10S
Mol. Mass.547.574
SMILESCO[C@H]1O[C@H](CO)[C@H](O)[C@H](OCc2cc3ccccc3o\c2=N/S(=O)(=O)c2ccc(C)cc2)[C@H]1OC(C)=O