Reaction Details
TargetDelta-type opioid receptor
LigandBDBM50048103
Substrate/Competitorn/a
Meas. Tech.ChEMBL_1454652 (CHEMBL3361841)
EC50 31±n/a nM
Citation Kumar, VClark, MJTraynor, JRLewis, JWHusbands, SM Pyrrolo- and pyridomorphinans: non-selective opioid antagonists and delta opioid agonists/mu opioid partial agonists. Bioorg Med Chem22:4067-72 (2014) 
 
Delta-type opioid receptor
Name:Delta-type opioid receptor
Type:G Protein-Coupled Receptor (GPCR)
Mol. Mass.:40382.98
Organism:Homo sapiens (Human)
Description:Competition binding assays were carried out using membrane preparations from transfected HN9.10 cells that constitutively expressed the delta opioid receptor.
Residue:372
BDBM50048103
NameBDBM50048103
Synonyms:CHEMBL3309509
TypeSmall organic molecule
Emp. Form.C23H28N2O5
Mol. Mass.412.4788
SMILES[H][C@@]12Oc3c4c(C[C@@]5([H])N(C)CC[C@@]14[C@@]5(O)CC1=C2N(C)C(=O)[C@@H](CCO)C1)ccc3O