Reaction Details
TargetMu-type opioid receptor
LigandBDBM50048105
Substrate/Competitorn/a
Meas. Tech.ChEMBL_1454642 (CHEMBL3361831)
Ki 3.0±n/a nM
Citation Kumar, VClark, MJTraynor, JRLewis, JWHusbands, SM Pyrrolo- and pyridomorphinans: non-selective opioid antagonists and delta opioid agonists/mu opioid partial agonists. Bioorg Med Chem22:4067-72 (2014) 
 
Mu-type opioid receptor
Name:Mu-type opioid receptor
Type:G Protein-Coupled Receptor (GPCR)
Mol. Mass.:44789.51
Organism:Homo sapiens (Human)
Description:P35372
Residue:400
BDBM50048105
NameBDBM50048105
Synonyms:CHEMBL3309510
TypeSmall organic molecule
Emp. Form.C29H32N2O5
Mol. Mass.488.5748
SMILES[H][C@@]12Oc3c4c(C[C@@]5([H])N(C)CC[C@@]14[C@@]5(O)CC1=C2N(Cc2ccccc2)C(=O)[C@@H](CCO)C1)ccc3O