Reaction Details
TargetKappa-type opioid receptor
LigandBDBM50048100
Substrate/Competitorn/a
Meas. Tech.ChEMBL_1454643 (CHEMBL3361832)
Ki 20±n/a nM
Citation Kumar, VClark, MJTraynor, JRLewis, JWHusbands, SM Pyrrolo- and pyridomorphinans: non-selective opioid antagonists and delta opioid agonists/mu opioid partial agonists. Bioorg Med Chem22:4067-72 (2014) 
 
Kappa-type opioid receptor
Name:Kappa-type opioid receptor
Type:G Protein-Coupled Receptor (GPCR)
Mol. Mass.:42648.76
Organism:Homo sapiens (Human)
Description:P41145
Residue:380
BDBM50048100
NameBDBM50048100
Synonyms:CHEMBL3309506
TypeSmall organic molecule
Emp. Form.C21H24N2O4
Mol. Mass.368.4263
SMILES[H][C@@]12Oc3c4c(C[C@@]5([H])N(C)CC[C@@]14[C@@]5(O)CC1=C2N(C)C(=O)CC1)ccc3O