Reaction Details
TargetKappa-type opioid receptor
LigandBDBM50048126
Substrate/Competitorn/a
Meas. Tech.ChEMBL_1454643 (CHEMBL3361832)
Ki 2.8±n/a nM
Citation Kumar, VClark, MJTraynor, JRLewis, JWHusbands, SM Pyrrolo- and pyridomorphinans: non-selective opioid antagonists and delta opioid agonists/mu opioid partial agonists. Bioorg Med Chem22:4067-72 (2014) 
 
Kappa-type opioid receptor
Name:Kappa-type opioid receptor
Type:G Protein-Coupled Receptor (GPCR)
Mol. Mass.:42648.76
Organism:Homo sapiens (Human)
Description:P41145
Residue:380
BDBM50048126
NameBDBM50048126
Synonyms:CHEMBL3309514
TypeSmall organic molecule
Emp. Form.C32H36N2O5
Mol. Mass.528.6386
SMILES[H][C@@]12Oc3c4c(C[C@@]5([H])N(CC6CC6)CC[C@@]14[C@@]5(O)CC1=C2N(Cc2ccccc2)C(=O)[C@@H](CCO)C1)ccc3O