Reaction Details
TargetDelta-type opioid receptor
LigandBDBM50048108
Substrate/Competitorn/a
Meas. Tech.ChEMBL_1454644 (CHEMBL3361833)
Ki 1.6±n/a nM
Citation Kumar, VClark, MJTraynor, JRLewis, JWHusbands, SM Pyrrolo- and pyridomorphinans: non-selective opioid antagonists and delta opioid agonists/mu opioid partial agonists. Bioorg Med Chem22:4067-72 (2014) 
 
Delta-type opioid receptor
Name:Delta-type opioid receptor
Type:G Protein-Coupled Receptor (GPCR)
Mol. Mass.:40382.98
Organism:Homo sapiens (Human)
Description:Competition binding assays were carried out using membrane preparations from transfected HN9.10 cells that constitutively expressed the delta opioid receptor.
Residue:372
BDBM50048108
NameBDBM50048108
Synonyms:CHEMBL3309512
TypeSmall organic molecule
Emp. Form.C31H34N2O4
Mol. Mass.498.6127
SMILES[H][C@@]12Oc3c4c(C[C@@]5([H])N(CC6CC6)CC[C@@]14[C@@]5(O)CC1=C2N(Cc2ccccc2)C(=O)[C@@H](C)C1)ccc3O