Reaction Details
TargetCytochrome P450 2C19
LigandBDBM31772
Substrate/Competitorn/a
Meas. Tech.ChEMBL_1455474 (CHEMBL3363906)
IC50 18000±n/a nM
Citation Yun, JHan, MSong, CCheon, SHChoi, KHahn, HG Synthesis and biological evaluation of 3-phenethylazetidine derivatives as triple reuptake inhibitors. Bioorg Med Chem Lett24:3234-7 (2014) 
 
Cytochrome P450 2C19
Name:Cytochrome P450 2C19
Type:Enzyme
Mol. Mass.:55935.47
Organism:Homo sapiens (Human)
Description:P33261
Residue:490
BDBM31772
NameBDBM31772
Synonyms:1-[2-(2,4-dichlorobenzyl)oxy-2-(2,4-dichlorophenyl)ethyl]imidazole;nitric acid CHEMBL91 Miconazole US9144538, Miconazole Nitrate | cid_4189
TypeSmall organic molecule
Emp. Form.C18H14Cl4N2O
Mol. Mass.416.129
SMILESClc1ccc(COC(Cn2ccnc2)c2ccc(Cl)cc2Cl)c(Cl)c1