Reaction Details
TargetC-X-C chemokine receptor type 2
LigandBDBM50048252
Substrate/Competitorn/a
Meas. Tech.ChEMBL_1456413 (CHEMBL3368862)
IC50 900±n/a nM
Citation Porter, DWBradley, MBrown, ZCharlton, SJCox, BHunt, PJanus, DLewis, SOakley, PO'Connor, DReilly, JSmith, NPress, NJ The discovery of potent, orally bioavailable pyrimidine-5-carbonitrile-6-alkyl CXCR2 receptor antagonists. Bioorg Med Chem Lett24:3285-90 (2014) 
 
C-X-C chemokine receptor type 2
Name:C-X-C chemokine receptor type 2
Type:Protein
Mol. Mass.:40767.88
Organism:Homo sapiens (Human)
Description:P25025
Residue:360
BDBM50048252
NameBDBM50048252
Synonyms:CHEMBL3310780
TypeSmall organic molecule
Emp. Form.C15H13F2N3OS
Mol. Mass.321.345
SMILESCC(C)c1nc(SCc2cccc(F)c2F)nc(O)c1C#N