Reaction Details
TargetcAMP and cAMP-inhibited cGMP 3',5'-cyclic phosphodiesterase 10A
LigandBDBM50048260
Substrate/Competitorn/a
Meas. Tech.ChEMBL_1458262 (CHEMBL3368977)
IC50 0.300000±n/a nM
Citation Das, SShelke, DEHarde, RLAvhad, VBKhairatkar-Joshi, NGullapalli, SGupta, PKGandhi, MNBhateja, DKBajpai, MJoshi, AAMarathe, MYGudi, GSJadhav, SBMahat, MYThomas, A Design, synthesis and pharmacological evaluation of novel polycyclic heteroarene ethers as PDE10A inhibitors: part II. Bioorg Med Chem Lett24:3238-42 (2014) 
 
cAMP and cAMP-inhibited cGMP 3',5'-cyclic phosphodiesterase 10A
Name:cAMP and cAMP-inhibited cGMP 3',5'-cyclic phosphodiesterase 10A
Type:Protein
Mol. Mass.:88412.52
Organism:Homo sapiens (Human)
Description:Q9Y233
Residue:779
BDBM50048260
NameBDBM50048260
Synonyms:CHEMBL3315045
TypeSmall organic molecule
Emp. Form.C25H20N4O
Mol. Mass.392.4525
SMILESCc1cnc2c(cn(C)c2c1)-c1ccc(Oc2ncccc2-c2ccncc2)cc1