Reaction Details
TargetGlucocorticoid receptor
LigandBDBM50048336
Substrate/Competitorn/a
Meas. Tech.ChEMBL_1459132 (CHEMBL3370677)
Ki 5.7±n/a nM
Citation Gong, HYang, MXiao, ZDoweyko, AMCunningham, MWang, JHabte, SHolloway, DBurke, CShuster, DGao, LCarman, JSomerville, JENadler, SGSalter-Cid, LBarrish, JCWeinstein, DS Discovery of acylurea isosteres of 2-acylaminothiadiazole in the azaxanthene series of glucocorticoid receptor agonists. Bioorg Med Chem Lett24:3268-73 (2014) 
 
Glucocorticoid receptor
Name:Glucocorticoid receptor
Type:Enzyme
Mol. Mass.:85656.87
Organism:Homo sapiens (Human)
Description:P04150
Residue:777
BDBM50048336
NameBDBM50048336
Synonyms:CHEMBL3315058 | US9593113, Example 22
TypeSmall organic molecule
Emp. Form.C30H31FN4O5
Mol. Mass.546.5893
SMILESCCNC(=O)NC(=O)C(C)(C)[C@@H]1c2ccc(nc2Oc2c(F)cccc12)-c1ccc(cc1)C(=O)N1CCOCC1