Reaction Details
TargetGlucocorticoid receptor
LigandBDBM50048343
Substrate/Competitorn/a
Meas. Tech.ChEMBL_1459132 (CHEMBL3370677)
Ki 1.9±n/a nM
Citation Gong, HYang, MXiao, ZDoweyko, AMCunningham, MWang, JHabte, SHolloway, DBurke, CShuster, DGao, LCarman, JSomerville, JENadler, SGSalter-Cid, LBarrish, JCWeinstein, DS Discovery of acylurea isosteres of 2-acylaminothiadiazole in the azaxanthene series of glucocorticoid receptor agonists. Bioorg Med Chem Lett24:3268-73 (2014) 
 
Glucocorticoid receptor
Name:Glucocorticoid receptor
Type:Enzyme
Mol. Mass.:85656.87
Organism:Homo sapiens (Human)
Description:P04150
Residue:777
BDBM50048343
NameBDBM50048343
Synonyms:CHEMBL3315065 | US9593113, Example 40
TypeSmall organic molecule
Emp. Form.C28H28N4O4
Mol. Mass.484.5463
SMILESCC(C)([C@H]1c2ccccc2Oc2nc(ccc12)-c1ccc(cc1)C(=O)N1CCCC1)C(=O)NC(N)=O