Reaction Details
TargetGlucocorticoid receptor
LigandBDBM50048348
Substrate/Competitorn/a
Meas. Tech.ChEMBL_1459132 (CHEMBL3370677)
Ki 0.700000±n/a nM
Citation Gong, HYang, MXiao, ZDoweyko, AMCunningham, MWang, JHabte, SHolloway, DBurke, CShuster, DGao, LCarman, JSomerville, JENadler, SGSalter-Cid, LBarrish, JCWeinstein, DS Discovery of acylurea isosteres of 2-acylaminothiadiazole in the azaxanthene series of glucocorticoid receptor agonists. Bioorg Med Chem Lett24:3268-73 (2014) 
 
Glucocorticoid receptor
Name:Glucocorticoid receptor
Type:Enzyme
Mol. Mass.:85656.87
Organism:Homo sapiens (Human)
Description:P04150
Residue:777
BDBM50048348
NameBDBM50048348
Synonyms:CHEMBL3315070
TypeSmall organic molecule
Emp. Form.C25H25FN4O4
Mol. Mass.464.4888
SMILESCC(C)Oc1ccc(cn1)-c1ccc2[C@H](c3cccc(F)c3Oc2n1)C(C)(C)C(=O)NC(N)=O