Reaction Details
TargetMuscarinic acetylcholine receptor M3
LigandBDBM73209
Substrate/Competitorn/a
Meas. Tech.ChEMBL_1459949 (CHEMBL3367784)
Ki 13490±n/a nM
Citation Del Bello, FBonifazi, AQuaglia, WMazzolari, ABarocelli, EBertoni, SMatucci, RNesi, MPiergentili, AVistoli, G Mode of interaction of 1,4-dioxane agonists at the M2 and M3 muscarinic receptor orthosteric sites. Bioorg Med Chem Lett24:3255-9 (2014) 
 
Muscarinic acetylcholine receptor M3
Name:Muscarinic acetylcholine receptor M3
Type:Enzyme
Mol. Mass.:66151.03
Organism:Homo sapiens (Human)
Description:P20309
Residue:590
BDBM73209
NameBDBM73209
Synonyms:(+)-CIS-DIOXOLANE MLS000069362 cid_657346 trimethyl-[[(2S,4R)-2-methyl-1,3-dioxolan-4-yl]methyl]ammonium;iodide | trimethyl-[[(2S,4R)-2-methyl-1,3-dioxolan-4-yl]methyl]azanium;iodide
TypeSmall organic molecule
Emp. Form.C8H18NO2
Mol. Mass.160.2335
SMILESC[C@H]1OC[C@@H](C[N+](C)(C)C)O1