Reaction Details
TargetMuscarinic acetylcholine receptor M2
LigandBDBM50048352
Substrate/Competitorn/a
Meas. Tech.ChEMBL_1459948 (CHEMBL3367783)
Ki 1738±n/a nM
Citation Del Bello, FBonifazi, AQuaglia, WMazzolari, ABarocelli, EBertoni, SMatucci, RNesi, MPiergentili, AVistoli, G Mode of interaction of 1,4-dioxane agonists at the M2 and M3 muscarinic receptor orthosteric sites. Bioorg Med Chem Lett24:3255-9 (2014) 
 
Muscarinic acetylcholine receptor M2
Name:Muscarinic acetylcholine receptor M2
Type:GPCR
Mol. Mass.:51730.61
Organism:Homo sapiens (Human)
Description:P08172
Residue:466
BDBM50048352
NameBDBM50048352
Synonyms:CHEMBL3309718
TypeSmall organic molecule
Emp. Form.C8H18INO2
Mol. Mass.287.1385
SMILES[I-].C[N+](C)(C)C[C@@H]1COCCO1