Reaction Details
TargetMuscarinic acetylcholine receptor M2
LigandBDBM50004656
Substrate/Competitorn/a
Meas. Tech.ChEMBL_1459948 (CHEMBL3367783)
Ki 1230±n/a nM
Citation Del Bello, FBonifazi, AQuaglia, WMazzolari, ABarocelli, EBertoni, SMatucci, RNesi, MPiergentili, AVistoli, G Mode of interaction of 1,4-dioxane agonists at the M2 and M3 muscarinic receptor orthosteric sites. Bioorg Med Chem Lett24:3255-9 (2014) 
 
Muscarinic acetylcholine receptor M2
Name:Muscarinic acetylcholine receptor M2
Type:GPCR
Mol. Mass.:51730.61
Organism:Homo sapiens (Human)
Description:P08172
Residue:466
BDBM50004656
NameBDBM50004656
Synonyms:(2-Carbamoyloxy-ethyl)-trimethyl-ammonium (2-Hydroxyethyl)trimethyl ammonium chloride carbamate (carbachol)(2-Carbamoyloxy-ethyl)-trimethyl-ammonium 2-((Aminocarbonyl)oxy)-N,N,N-trimethylethanaminum chloride 2-(carbamoyloxy)-N,N,N-trimethylethanaminium chloride CARBASTAT Carbachol chloride Choline carbamate chloride Choline chlorine carbamate Karbamoylcholin chlorid | MIOSTAT
TypeSmall organic molecule
Emp. Form.C6H15N2O2
Mol. Mass.147.195
SMILESC[N+](C)(C)CCOC(N)=O