Reaction Details
TargetMuscarinic acetylcholine receptor M4
LigandBDBM50048353
Substrate/Competitorn/a
Meas. Tech.ChEMBL_1459950 (CHEMBL3367785)
Ki 1023±n/a nM
Citation Del Bello, FBonifazi, AQuaglia, WMazzolari, ABarocelli, EBertoni, SMatucci, RNesi, MPiergentili, AVistoli, G Mode of interaction of 1,4-dioxane agonists at the M2 and M3 muscarinic receptor orthosteric sites. Bioorg Med Chem Lett24:3255-9 (2014) 
 
Muscarinic acetylcholine receptor M4
Name:Muscarinic acetylcholine receptor M4
Type:Enzyme Catalytic Domain
Mol. Mass.:53079.31
Organism:Homo sapiens (Human)
Description:Cholinergic, muscarinic M4 CHRM4 HUMAN M3::P08173
Residue:479
BDBM50048353
NameBDBM50048353
Synonyms:Cevimeline
TypeSmall organic molecule
Emp. Form.C10H17NOS
Mol. Mass.199.313
SMILESCC1OC2(CS1)CN1CCC2CC1