Reaction Details
TargetMuscarinic acetylcholine receptor M1
LigandBDBM50048349
Substrate/Competitorn/a
Meas. Tech.ChEMBL_1459947 (CHEMBL3367782)
Ki<100000±n/a nM
Citation Del Bello, FBonifazi, AQuaglia, WMazzolari, ABarocelli, EBertoni, SMatucci, RNesi, MPiergentili, AVistoli, G Mode of interaction of 1,4-dioxane agonists at the M2 and M3 muscarinic receptor orthosteric sites. Bioorg Med Chem Lett24:3255-9 (2014) 
 
Muscarinic acetylcholine receptor M1
Name:Muscarinic acetylcholine receptor M1
Type:Protein
Mol. Mass.:51442.54
Organism:Homo sapiens (Human)
Description:P11229
Residue:460
BDBM50048349
NameBDBM50048349
Synonyms:CHEMBL3309717
TypeSmall organic molecule
Emp. Form.C9H20INO2
Mol. Mass.301.1651
SMILES[I-].C[C@H]1OCCO[C@@H]1C[N+](C)(C)C