Reaction Details
TargetMuscarinic acetylcholine receptor M2
LigandBDBM50048350
Substrate/Competitorn/a
Meas. Tech.ChEMBL_1459948 (CHEMBL3367783)
Ki<100000±n/a nM
Citation Del Bello, FBonifazi, AQuaglia, WMazzolari, ABarocelli, EBertoni, SMatucci, RNesi, MPiergentili, AVistoli, G Mode of interaction of 1,4-dioxane agonists at the M2 and M3 muscarinic receptor orthosteric sites. Bioorg Med Chem Lett24:3255-9 (2014) 
 
Muscarinic acetylcholine receptor M2
Name:Muscarinic acetylcholine receptor M2
Type:GPCR
Mol. Mass.:51730.61
Organism:Homo sapiens (Human)
Description:P08172
Residue:466
BDBM50048350
NameBDBM50048350
Synonyms:CHEMBL3309715
TypeSmall organic molecule
Emp. Form.C9H20INO2
Mol. Mass.301.1651
SMILES[I-].C[C@@]1(C[N+](C)(C)C)COCCO1