Reaction Details
TargetActivated CDC42 kinase 1
LigandBDBM50048357
Substrate/Competitorn/a
Meas. Tech.ChEMBL_1446742 (CHEMBL3381057)
IC50>10000±n/a nM
Citation Casale, EAmboldi, NBrasca, MGCaronni, DColombo, NDalvit, CFelder, ERFogliatto, GGalvani, AIsacchi, APolucci, PRiceputi, LSola, FVisco, CZuccotto, FCasuscelli, F Fragment-based hit discovery and structure-based optimization of aminotriazoloquinazolines as novel Hsp90 inhibitors. Bioorg Med Chem22:4135-50 (2014) 
 
Activated CDC42 kinase 1
Name:Activated CDC42 kinase 1
Type:Protein
Mol. Mass.:114577.86
Organism:Homo sapiens (Human)
Description:Q07912
Residue:1038
BDBM50048357
NameBDBM50048357
Synonyms:CHEMBL3309990
TypeSmall organic molecule
Emp. Form.C17H12FN5O2
Mol. Mass.337.3079
SMILESNc1nc2c3c(F)cccc3nc(Cc3ccc4OCOc4c3)n2n1