Reaction Details
Target40S ribosomal protein S27
LigandBDBM50048365
Substrate/Competitorn/a
Meas. Tech.ChEMBL_1446775 (CHEMBL3381090)
IC50>10000±n/a nM
Citation Casale, EAmboldi, NBrasca, MGCaronni, DColombo, NDalvit, CFelder, ERFogliatto, GGalvani, AIsacchi, APolucci, PRiceputi, LSola, FVisco, CZuccotto, FCasuscelli, F Fragment-based hit discovery and structure-based optimization of aminotriazoloquinazolines as novel Hsp90 inhibitors. Bioorg Med Chem22:4135-50 (2014) 
 
40S ribosomal protein S27
Name:40S ribosomal protein S27
Type:PROTEIN
Mol. Mass.:9472.13
Organism:Homo sapiens (Human)
Description:ChEMBL_1446775
Residue:84
BDBM50048365
NameBDBM50048365
Synonyms:CHEMBL3309998
TypeSmall organic molecule
Emp. Form.C19H18N6O3
Mol. Mass.378.3846
SMILESNc1nc2c3ccc(NCCO)cc3nc(Cc3ccc4OCOc4c3)n2n1