Reaction Details
TargetSerine/threonine-protein kinase 26
LigandBDBM50048357
Substrate/Competitorn/a
Meas. Tech.ChEMBL_1446776 (CHEMBL3381091)
IC50>10000±n/a nM
Citation Casale, EAmboldi, NBrasca, MGCaronni, DColombo, NDalvit, CFelder, ERFogliatto, GGalvani, AIsacchi, APolucci, PRiceputi, LSola, FVisco, CZuccotto, FCasuscelli, F Fragment-based hit discovery and structure-based optimization of aminotriazoloquinazolines as novel Hsp90 inhibitors. Bioorg Med Chem22:4135-50 (2014) 
 
Serine/threonine-protein kinase 26
Name:Serine/threonine-protein kinase 26
Type:PROTEIN
Mol. Mass.:46517.68
Organism:Homo sapiens (Human)
Description:ChEMBL_1510631
Residue:416
BDBM50048357
NameBDBM50048357
Synonyms:CHEMBL3309990
TypeSmall organic molecule
Emp. Form.C17H12FN5O2
Mol. Mass.337.3079
SMILESNc1nc2c3c(F)cccc3nc(Cc3ccc4OCOc4c3)n2n1