Reaction Details
TargetSerine/threonine-protein kinase Nek6
LigandBDBM50048362
Substrate/Competitorn/a
Meas. Tech.ChEMBL_1446777 (CHEMBL3381092)
IC50>10000±n/a nM
Citation Casale, EAmboldi, NBrasca, MGCaronni, DColombo, NDalvit, CFelder, ERFogliatto, GGalvani, AIsacchi, APolucci, PRiceputi, LSola, FVisco, CZuccotto, FCasuscelli, F Fragment-based hit discovery and structure-based optimization of aminotriazoloquinazolines as novel Hsp90 inhibitors. Bioorg Med Chem22:4135-50 (2014) 
 
Serine/threonine-protein kinase Nek6
Name:Serine/threonine-protein kinase Nek6
Type:PROTEIN
Mol. Mass.:35724.53
Organism:Homo sapiens (Human)
Description:ChEMBL_1446777
Residue:313
BDBM50048362
NameBDBM50048362
Synonyms:CHEMBL3309995
TypeSmall organic molecule
Emp. Form.C17H14N6O2
Mol. Mass.334.3321
SMILESNc1nc2c3ccc(N)cc3nc(Cc3ccc4OCOc4c3)n2n1