Reaction Details
TargetHigh affinity nerve growth factor receptor
LigandBDBM50048364
Substrate/Competitorn/a
Meas. Tech.ChEMBL_1446791 (CHEMBL3371265)
IC50>10000±n/a nM
Citation Casale, EAmboldi, NBrasca, MGCaronni, DColombo, NDalvit, CFelder, ERFogliatto, GGalvani, AIsacchi, APolucci, PRiceputi, LSola, FVisco, CZuccotto, FCasuscelli, F Fragment-based hit discovery and structure-based optimization of aminotriazoloquinazolines as novel Hsp90 inhibitors. Bioorg Med Chem22:4135-50 (2014) 
 
High affinity nerve growth factor receptor
Name:High affinity nerve growth factor receptor
Type:n/a
Mol. Mass.:87498.18
Organism:Homo sapiens (Human)
Description:P04629
Residue:796
BDBM50048364
NameBDBM50048364
Synonyms:CHEMBL3309997
TypeSmall organic molecule
Emp. Form.C19H17N5O3
Mol. Mass.363.37
SMILESOCCCNc1ccc2c3ncnn3c(nc2c1)-c1ccc2OCOc2c1