Reaction Details
TargetVascular endothelial growth factor receptor 3
LigandBDBM50048365
Substrate/Competitorn/a
Meas. Tech.ChEMBL_1447672 (CHEMBL3375008)
IC50>10000±n/a nM
Citation Casale, EAmboldi, NBrasca, MGCaronni, DColombo, NDalvit, CFelder, ERFogliatto, GGalvani, AIsacchi, APolucci, PRiceputi, LSola, FVisco, CZuccotto, FCasuscelli, F Fragment-based hit discovery and structure-based optimization of aminotriazoloquinazolines as novel Hsp90 inhibitors. Bioorg Med Chem22:4135-50 (2014) 
 
Vascular endothelial growth factor receptor 3
Name:Vascular endothelial growth factor receptor 3
Type:Protein
Mol. Mass.:152749.58
Organism:Homo sapiens (Human)
Description:P35916-2
Residue:1363
BDBM50048365
NameBDBM50048365
Synonyms:CHEMBL3309998
TypeSmall organic molecule
Emp. Form.C19H18N6O3
Mol. Mass.378.3846
SMILESNc1nc2c3ccc(NCCO)cc3nc(Cc3ccc4OCOc4c3)n2n1