Reaction Details
TargetHeat shock cognate 71 kDa protein
LigandBDBM50048374
Substrate/Competitorn/a
Meas. Tech.ChEMBL_1447674 (CHEMBL3375010)
IC50>10000±n/a nM
Citation Casale, EAmboldi, NBrasca, MGCaronni, DColombo, NDalvit, CFelder, ERFogliatto, GGalvani, AIsacchi, APolucci, PRiceputi, LSola, FVisco, CZuccotto, FCasuscelli, F Fragment-based hit discovery and structure-based optimization of aminotriazoloquinazolines as novel Hsp90 inhibitors. Bioorg Med Chem22:4135-50 (2014) 
 
Heat shock cognate 71 kDa protein
Name:Heat shock cognate 71 kDa protein
Type:Enzyme Catalytic Domain
Mol. Mass.:70887.67
Organism:Homo sapiens (Human)
Description:gi_5729877
Residue:646
BDBM50048374
NameBDBM50048374
Synonyms:CHEMBL3310151
TypeSmall organic molecule
Emp. Form.C22H22FN7O2
Mol. Mass.435.4542
SMILESCN1CCN(CC1)c1cc(F)c2c3nc(N)nn3c(Cc3ccc4OCOc4c3)nc2c1