Reaction Details
TargetInhibitor of nuclear factor kappa-B kinase subunit beta
LigandBDBM50048364
Substrate/Competitorn/a
Meas. Tech.ChEMBL_1446763 (CHEMBL3381078)
IC50>10000±n/a nM
Citation Casale, EAmboldi, NBrasca, MGCaronni, DColombo, NDalvit, CFelder, ERFogliatto, GGalvani, AIsacchi, APolucci, PRiceputi, LSola, FVisco, CZuccotto, FCasuscelli, F Fragment-based hit discovery and structure-based optimization of aminotriazoloquinazolines as novel Hsp90 inhibitors. Bioorg Med Chem22:4135-50 (2014) 
 
Inhibitor of nuclear factor kappa-B kinase subunit beta
Name:Inhibitor of nuclear factor kappa-B kinase subunit beta
Type:Serine/threonine-protein kinase
Mol. Mass.:86554.39
Organism:Homo sapiens (Human)
Description:GST-tagged IKK-2 was expressed in High Five cells and purified.
Residue:756
BDBM50048364
NameBDBM50048364
Synonyms:CHEMBL3309997
TypeSmall organic molecule
Emp. Form.C19H17N5O3
Mol. Mass.363.37
SMILESOCCCNc1ccc2c3ncnn3c(nc2c1)-c1ccc2OCOc2c1