Reaction Details
TargetInsulin receptor
LigandBDBM50048364
Substrate/Competitorn/a
Meas. Tech.ChEMBL_1446764 (CHEMBL3381079)
IC50>10000±n/a nM
Citation Casale, EAmboldi, NBrasca, MGCaronni, DColombo, NDalvit, CFelder, ERFogliatto, GGalvani, AIsacchi, APolucci, PRiceputi, LSola, FVisco, CZuccotto, FCasuscelli, F Fragment-based hit discovery and structure-based optimization of aminotriazoloquinazolines as novel Hsp90 inhibitors. Bioorg Med Chem22:4135-50 (2014) 
 
Insulin receptor
Name:Insulin receptor
Type:Receptor Tyrosine Kinase
Mol. Mass.:156322.60
Organism:Homo sapiens (Human)
Description:P06213
Residue:1382
BDBM50048364
NameBDBM50048364
Synonyms:CHEMBL3309997
TypeSmall organic molecule
Emp. Form.C19H17N5O3
Mol. Mass.363.37
SMILESOCCCNc1ccc2c3ncnn3c(nc2c1)-c1ccc2OCOc2c1