Reaction Details
TargetSubstance-K receptor
LigandBDBM50048413
Substrate/Competitorn/a
Meas. Tech.ChEMBL_1447676 (CHEMBL3375012)
Ki 0.154882±n/a nM
Citation Ma, ZDu, LLi, M Toward fluorescent probes for G-protein-coupled receptors (GPCRs). J Med Chem57:8187-203 (2014) 
 
Substance-K receptor
Name:Substance-K receptor
Type:Protein
Mol. Mass.:44455.78
Organism:Homo sapiens (Human)
Description:P21452
Residue:398
BDBM50048413
NameBDBM50048413
Synonyms:CHEMBL2370064
TypeSmall organic molecule
Emp. Form.C49H61N9O8
Mol. Mass.904.0641
SMILESCCCC[C@H](NC(=O)[C@@H]1CCCN1C(=O)[C@H]1CCCN1C(=O)[C@H](Cc1ccccc1)NC(=O)[C@@H](Cc1c[nH]c2ccccc12)NC(=O)[C@H](C)NC(=O)[C@H](C)NC(=O)c1ccccc1)C(N)=O