Reaction Details
TargetCannabinoid receptor 2
LigandBDBM50048480
Substrate/Competitorn/a
Meas. Tech.ChEMBL_1447731 (CHEMBL3376223)
EC50 6607±n/a nM
Citation Nimczick, MPemp, DDarras, FHChen, XHeilmann, JDecker, M Synthesis and biological evaluation of bivalent cannabinoid receptor ligands based on hCB2R selective benzimidazoles reveal unexpected intrinsic properties. Bioorg Med Chem22:3938-46 (2014) 
 
Cannabinoid receptor 2
Name:Cannabinoid receptor 2
Type:G Protein-Coupled Receptor (GPCR)
Mol. Mass.:39690.94
Organism:Homo sapiens (Human)
Description:P34972
Residue:360
BDBM50048480
NameBDBM50048480
Synonyms:CHEMBL3310161
TypeSmall organic molecule
Emp. Form.C63H91N7O4
Mol. Mass.1010.4411
SMILESCCOc1ccc(Cc2nc3cc(ccc3n2CCCCCCCCCCN(C)CCCCCCCCCCn2c(Cc3ccc(OCC)cc3)nc3cc(ccc23)C(=O)N(CC)CC)C(=O)N(CC)CC)cc1