Reaction Details
TargetCannabinoid receptor 2
LigandBDBM50048488
Substrate/Competitorn/a
Meas. Tech.ChEMBL_1447732 (CHEMBL3376224)
EC50 295±n/a nM
Citation Nimczick, MPemp, DDarras, FHChen, XHeilmann, JDecker, M Synthesis and biological evaluation of bivalent cannabinoid receptor ligands based on hCB2R selective benzimidazoles reveal unexpected intrinsic properties. Bioorg Med Chem22:3938-46 (2014) 
 
Cannabinoid receptor 2
Name:Cannabinoid receptor 2
Type:G Protein-Coupled Receptor (GPCR)
Mol. Mass.:39690.94
Organism:Homo sapiens (Human)
Description:P34972
Residue:360
BDBM50048488
NameBDBM50048488
Synonyms:CHEMBL3310158
TypeSmall organic molecule
Emp. Form.C23H28N2O3
Mol. Mass.380.48
SMILESCCOc1ccc(Cc2nc3cc(ccc3n2CCC(C)C)C(=O)OC)cc1