Reaction Details
TargetCannabinoid receptor 1
LigandBDBM21279
Substrate/Competitorn/a
Meas. Tech.ChEMBL_1448524 (CHEMBL3379276)
EC50 58±n/a nM
Citation Nimczick, MPemp, DDarras, FHChen, XHeilmann, JDecker, M Synthesis and biological evaluation of bivalent cannabinoid receptor ligands based on hCB2R selective benzimidazoles reveal unexpected intrinsic properties. Bioorg Med Chem22:3938-46 (2014) 
 
Cannabinoid receptor 1
Name:Cannabinoid receptor 1
Type:G Protein-Coupled Receptor (GPCR)
Mol. Mass.:52868.96
Organism:Homo sapiens (Human)
Description:P21554
Residue:472
BDBM21279
NameBDBM21279
Synonyms:1-(2,4-dichlorophenyl)-5-(4-iodophenyl)-4-methyl-N-(piperidin-1-yl)-1H-pyrazole-3-carboxamide AM-251 CHEMBL285932 | N-(piperidin-1-yl)-1-(2,4-dichlorophenyl)-5-(4-iodophenyl)-4-methyl-1H-pyrazole-3-carboxamide
TypeSmall organic molecule
Emp. Form.C22H21Cl2IN4O
Mol. Mass.555.239
SMILESCc1c(nn(c1-c1ccc(I)cc1)-c1ccc(Cl)cc1Cl)C(=O)NN1CCCCC1