Reaction Details
TargetCannabinoid receptor 1
LigandBDBM50048486
Substrate/Competitorn/a
Meas. Tech.ChEMBL_1448524 (CHEMBL3379276)
EC50 17378±n/a nM
Citation Nimczick, MPemp, DDarras, FHChen, XHeilmann, JDecker, M Synthesis and biological evaluation of bivalent cannabinoid receptor ligands based on hCB2R selective benzimidazoles reveal unexpected intrinsic properties. Bioorg Med Chem22:3938-46 (2014) 
 
Cannabinoid receptor 1
Name:Cannabinoid receptor 1
Type:G Protein-Coupled Receptor (GPCR)
Mol. Mass.:52868.96
Organism:Homo sapiens (Human)
Description:P21554
Residue:472
BDBM50048486
NameBDBM50048486
Synonyms:CHEMBL3310167
TypeSmall organic molecule
Emp. Form.C51H67N7O4
Mol. Mass.842.1222
SMILESCCOc1ccc(Cc2nc3cc(ccc3n2CCC(C)C)C(=O)NCCCN(C)CCCNC(=O)c2ccc3n(CCC(C)C)c(Cc4ccc(OCC)cc4)nc3c2)cc1