Reaction Details
TargetCannabinoid receptor 1
LigandBDBM50048487
Substrate/Competitorn/a
Meas. Tech.ChEMBL_1448525 (CHEMBL3379277)
EC50 1349±n/a nM
Citation Nimczick, MPemp, DDarras, FHChen, XHeilmann, JDecker, M Synthesis and biological evaluation of bivalent cannabinoid receptor ligands based on hCB2R selective benzimidazoles reveal unexpected intrinsic properties. Bioorg Med Chem22:3938-46 (2014) 
 
Cannabinoid receptor 1
Name:Cannabinoid receptor 1
Type:G Protein-Coupled Receptor (GPCR)
Mol. Mass.:52868.96
Organism:Homo sapiens (Human)
Description:P21554
Residue:472
BDBM50048487
NameBDBM50048487
Synonyms:CHEMBL3310157
TypeSmall organic molecule
Emp. Form.C25H33N3O2
Mol. Mass.407.5484
SMILESCCCCn1c(Cc2ccc(OCC)cc2)nc2cc(ccc12)C(=O)N(CC)CC