Reaction Details
TargetBotulinum neurotoxin type A
LigandBDBM50048539
Substrate/Competitorn/a
Meas. Tech.ChEMBL_1448541 (CHEMBL3379293)
Ki 7700±n/a nM
Citation Bremer, PTHixon, MSJanda, KD Benzoquinones as inhibitors of botulinum neurotoxin serotype A. Bioorg Med Chem22:3971-81 (2014) 
 
Botulinum neurotoxin type A
Name:Botulinum neurotoxin type A
Type:PROTEIN
Mol. Mass.:149450.01
Organism:Clostridium botulinum
Description:ChEMBL_1510137
Residue:1296
BDBM50048539
NameBDBM50048539
Synonyms:CHEMBL3309328
TypeSmall organic molecule
Emp. Form.C4H11NO2S2
Mol. Mass.169.266
SMILESCS(=O)(=O)SCCCN