Reaction Details
TargetAromatase
LigandBDBM23419
Substrate/Competitorn/a
Meas. Tech.ChEMBL_1451081 (CHEMBL3366858)
IC50 1200±n/a nM
Citation Parrish, SMYoshida, WYKondratyuk, TPPark, EJPezzuto, JMKelly, MWilliams, PG Spongiapyridine and related spongians isolated from an Indonesian Spongia sp. J Nat Prod77:1644-9 (2014) 
 
Aromatase
Name:Aromatase
Type:Enzyme
Mol. Mass.:57888.92
Organism:Homo sapiens (Human)
Description:P11511
Residue:503
BDBM23419
NameBDBM23419
Synonyms:(2S)-5,7-dihydroxy-2-(4-hydroxyphenyl)-3,4-dihydro-2H-1-benzopyran-4-one Naringenin
Typeflavanone
Emp. Form.C15H12O5
Mol. Mass.272.2528
SMILESOc1ccc(cc1)[C@@H]1CC(=O)c2c(O)cc(O)cc2O1