Reaction Details
TargetProto-oncogene tyrosine-protein kinase ROS
LigandBDBM50048846
Substrate/Competitorn/a
Meas. Tech.ChEMBL_1452909 (CHEMBL3366561)
IC50 133±n/a nM
Citation Park, BSAl-Sanea, MMAbdelazem, AZPark, HMRoh, EJPark, HMYoo, KHSim, TTae, JSLee, SH Structure-based optimization and biological evaluation of trisubstituted pyrazole as a core structure of potent ROS1 kinase inhibitors. Bioorg Med Chem22:3871-8 (2014) 
 
Proto-oncogene tyrosine-protein kinase ROS
Name:Proto-oncogene tyrosine-protein kinase ROS
Type:Enzyme
Mol. Mass.:263897.39
Organism:Homo sapiens (Human)
Description:P08922
Residue:2347
BDBM50048846
NameBDBM50048846
Synonyms:CHEMBL3310334
TypeSmall organic molecule
Emp. Form.C24H26N6O2
Mol. Mass.430.5022
SMILESCc1cc(O)cc(c1)-c1nn(C)cc1-c1cc(NCCCCO)nc(n1)-c1cccnc1