Reaction Details
TargetHistone deacetylase 6
LigandBDBM50005711
Substrate/Competitorn/a
Meas. Tech.ChEMBL_1452942 (CHEMBL3366594)
IC50 65±n/a nM
Citation Hoque, MAIslam, MNIslam, MSKato, TNishino, NIto, AYoshida, M Design and synthesis of CHAP31, trapoxin B and HC-toxin based bicyclic tetrapeptides disulfide as potent histone deacetylase inhibitors. Bioorg Med Chem22:3850-5 (2014) 
 
Histone deacetylase 6
Name:Histone deacetylase 6
Type:PROTEIN
Mol. Mass.:125762.28
Organism:Mus musculus
Description:ChEMBL_1460074
Residue:1149
BDBM50005711
NameBDBM50005711
Synonyms:CHEBI:46024 TRICHOSTATIN Trichostatin A (TSA) US10722597, Compound Trichostatin US20230322747, Compound trichostatin A | US9265734, TSA
TypeSmall organic molecule
Emp. Form.C17H22N2O3
Mol. Mass.302.3682
SMILESC[C@H](\C=C(/C)\C=C\C(=O)NO)C(=O)c1ccc(cc1)N(C)C