Reaction Details
TargetHistone deacetylase 1
LigandBDBM50048864
Substrate/Competitorn/a
Meas. Tech.ChEMBL_1452945 (CHEMBL3366597)
IC50 1.000000±n/a nM
Citation Hoque, MAIslam, MNIslam, MSKato, TNishino, NIto, AYoshida, M Design and synthesis of CHAP31, trapoxin B and HC-toxin based bicyclic tetrapeptides disulfide as potent histone deacetylase inhibitors. Bioorg Med Chem22:3850-5 (2014) 
 
Histone deacetylase 1
Name:Histone deacetylase 1
Type:Enzyme
Mol. Mass.:55090.27
Organism:Homo sapiens (Human)
Description:Q13547
Residue:482
BDBM50048864
NameBDBM50048864
Synonyms:CHEMBL3310505
TypeSmall organic molecule
Emp. Form.C24H36N4O6S2
Mol. Mass.540.696
SMILES[H][C@@]12CC(=O)N[C@H](C(C)C)C(=O)N[C@]([H])(CSSCC\C=C\1)C(=O)N\C(=C/C)C(=O)N[C@@H](C(C)C)C(=O)O2