Reaction Details
TargetHistone deacetylase 4
LigandBDBM50048860
Substrate/Competitorn/a
Meas. Tech.ChEMBL_1452946 (CHEMBL3366598)
IC50 4.2±n/a nM
Citation Hoque, MAIslam, MNIslam, MSKato, TNishino, NIto, AYoshida, M Design and synthesis of CHAP31, trapoxin B and HC-toxin based bicyclic tetrapeptides disulfide as potent histone deacetylase inhibitors. Bioorg Med Chem22:3850-5 (2014) 
 
Histone deacetylase 4
Name:Histone deacetylase 4
Type:Enzyme
Mol. Mass.:119049.39
Organism:Homo sapiens (Human)
Description:P56524
Residue:1084
BDBM50048860
NameBDBM50048860
Synonyms:CHEMBL3310508
TypeSmall organic molecule
Emp. Form.C28H40N4O4S2
Mol. Mass.560.772
SMILES[H][C@]12CCCN1C(=O)[C@H](Cc1ccccc1)NC(=O)[C@@]1([H])CCCCCSSCCCCC[C@]([H])(NC2=O)C(=O)N1