Reaction Details
TargetProtein kinase C theta type
LigandBDBM50053777
Substrate/Competitorn/a
Meas. Tech.ChEMBL_1454725 (CHEMBL3362644)
IC50 3300±n/a nM
Citation George, DMBreinlinger, ECFriedman, MZhang, YWang, JArgiriadi, MBansal-Pakala, PBarth, MDuignan, DBHonore, PLang, QMittelstadt, SPotin, DRundell, LEdmunds, JJ Discovery of selective and orally bioavailable protein kinase C¿ (PKC¿) inhibitors from a fragment hit. J Med Chem58:222-36 (2015) 
 
Protein kinase C theta type
Name:Protein kinase C theta type
Type:Serine/threonine-protein kinase
Mol. Mass.:81878.04
Organism:Homo sapiens (Human)
Description:Full-length human PKC theta (Panvera Catalog No. P2996).
Residue:706
BDBM50053777
NameBDBM50053777
Synonyms:CHEMBL3356447
TypeSmall organic molecule
Emp. Form.C14H17N5O2
Mol. Mass.287.3171
SMILESO=C1CN2C(COc3ccc(NC4CCNC4)cc23)=NN1