Reaction Details
TargetProtein kinase C epsilon type
LigandBDBM50049439
Substrate/Competitorn/a
Meas. Tech.ChEMBL_1454736 (CHEMBL3362928)
IC50 460±n/a nM
Citation George, DMBreinlinger, ECFriedman, MZhang, YWang, JArgiriadi, MBansal-Pakala, PBarth, MDuignan, DBHonore, PLang, QMittelstadt, SPotin, DRundell, LEdmunds, JJ Discovery of selective and orally bioavailable protein kinase C¿ (PKC¿) inhibitors from a fragment hit. J Med Chem58:222-36 (2015) 
 
Protein kinase C epsilon type
Name:Protein kinase C epsilon type
Type:Enzyme
Mol. Mass.:83680.45
Organism:Homo sapiens (Human)
Description:The recombinant human PKC enzymes were produced using a baculovirus expression system in SF9 cells
Residue:737
BDBM50049439
NameBDBM50049439
Synonyms:CHEMBL3356472
TypeSmall organic molecule
Emp. Form.C20H21N5O2
Mol. Mass.363.413
SMILESC[C@H]1N2C(COc3cc(c(NC4CNC4)cc23)-c2ccccc2)=NNC1=O