Reaction Details
TargetPotassium voltage-gated channel subfamily H member 2
LigandBDBM50028445
Substrate/Competitorn/a
Meas. Tech.ChEMBL_1455543 (CHEMBL3364596)
IC50>30000±n/a nM
Citation George, DMBreinlinger, ECFriedman, MZhang, YWang, JArgiriadi, MBansal-Pakala, PBarth, MDuignan, DBHonore, PLang, QMittelstadt, SPotin, DRundell, LEdmunds, JJ Discovery of selective and orally bioavailable protein kinase C¿ (PKC¿) inhibitors from a fragment hit. J Med Chem58:222-36 (2015) 
 
Potassium voltage-gated channel subfamily H member 2
Name:Potassium voltage-gated channel subfamily H member 2
Type:Multi-pass membrane protein
Mol. Mass.:126672.65
Organism:Homo sapiens (Human)
Description:Q12809
Residue:1159
BDBM50028445
NameBDBM50028445
Synonyms:CHEMBL3355112
TypeSmall organic molecule
Emp. Form.C16H18F3N5O2
Mol. Mass.369.3416
SMILESC[C@H]1N2C(COc3cc(c(NC4(C)CNC4)cc23)C(F)(F)F)=NNC1=O