Reaction Details
TargetProtein kinase C theta type
LigandBDBM50049443
Substrate/Competitorn/a
Meas. Tech.ChEMBL_1454725 (CHEMBL3362644)
IC50 190±n/a nM
Citation George, DMBreinlinger, ECFriedman, MZhang, YWang, JArgiriadi, MBansal-Pakala, PBarth, MDuignan, DBHonore, PLang, QMittelstadt, SPotin, DRundell, LEdmunds, JJ Discovery of selective and orally bioavailable protein kinase C¿ (PKC¿) inhibitors from a fragment hit. J Med Chem58:222-36 (2015) 
 
Protein kinase C theta type
Name:Protein kinase C theta type
Type:Serine/threonine-protein kinase
Mol. Mass.:81878.04
Organism:Homo sapiens (Human)
Description:Full-length human PKC theta (Panvera Catalog No. P2996).
Residue:706
BDBM50049443
NameBDBM50049443
Synonyms:CHEMBL3356468
TypeSmall organic molecule
Emp. Form.C15H15F3N4O3
Mol. Mass.356.2998
SMILESCC1N2C(COc3cc(c(OC4CNC4)cc23)C(F)(F)F)=NNC1=O